{"text_format":"1","workbook":"xlsx","n_sheets":18,"sheets":["Title","F&A Rates","Fringe Rates","Salaries Yr 1","Salaries Yr 2","Salaries Yr 3","Salaries Yr 4","Salaries Yr 5","Tuition Remission","Supplies","Equipment & Capital","Travel","Participant Support Costs","Other Direct","Sub-Agreements","MTDC","Total","NIH Modular"],"not_rendered":{"charts":0,"images":0,"macros":1,"external_links":0,"defined_names":14,"comments":0,"pivot_tables":0},"unopened":[],"bounds":{"document_bytes":16777216,"sheet_cells":100000,"rows_first":2000,"rows_last":500,"rows_between":2000,"halvings":0,"cell_chars":16384,"cell_head_chars":4096},"cells_cut":0,"cells_raw":0,"read":"whole","date_system":"1900"}

{"sheet":"Title","index":0,"n_rows":15,"n_cols":9,"rows_kept":15,"cut":false,"hidden":false,"merged":[[13,0,13,6],[14,0,14,8],[1,2,1,10],[3,2,3,10],[5,8,5,9],[7,2,7,8],[11,5,11,7]]}
[null,null,null,"Worksheet for Project Budget"]
["Sponsor:"]
[]
["Project Title:"]
[]
["Project Period:",null,"Begin:",null,"End:",null,"Years:",null,"Enter number of years in project."]
[]
["Principal Investigator:"]
[]
["Indirect Cost Rate:",null,0.55500000000000005,"     Inflation rate:",null,0.03]
{"$rows_left_out":6}
{"sheet":"F&A Rates","index":1,"n_rows":23,"n_cols":3,"rows_kept":23,"cut":false,"hidden":false,"merged":[[12,0,13,0],[14,0,14,2],[0,0,0,2],[1,0,1,2],[2,0,2,2],[5,0,8,0],[5,1,6,1],[5,2,6,2]]}
["Table of Indirect Cost Rates Rate Agreement"]
[" "]
["Effective July 1, 2025 through June 30, 2026"]
[]
["Source of Funds","Applicable To","Indirect Cost Rate"]
["Federal, Non-Direct Federal Federal, For Profit Entities, Non-Profit Entities, Non-Federal governmental Agencies","Research","55.5% of MTDC"]
[null," "," "]
[null,"Public Service","38.0% of MTDC"]
[null,"Instruction","53.0% of MTDC"]
["Industry-Sponsored\n(new trials effective 7/11/2025)","Clinical Trials","32.0% of TDC"]
{"$rows_left_out":14}
{"sheet":"Fringe Rates","index":2,"n_rows":19,"n_cols":2,"rows_kept":19,"cut":false,"hidden":false,"merged":[]}
["Fringe Rates","FY 2026"]
[]
["Category","Rate"]
["Academic Staff",0.34699999999999998]
["Ad Hoc Program Specialists",0.14599999999999999]
["Grad Interns",0.253]
["Limited Term Employees",0.10100000000000001]
["Post-Doc Fellows and/or Trainees",0.158]
["Pre-Doc Fellows and/or Trainees",0.20699999999999999]
["Program Assistants",0.20699999999999999]
{"$rows_left_out":10}
{"sheet":"Salaries Yr 1","index":3,"n_rows":25,"n_cols":11,"rows_kept":25,"cut":false,"hidden":false,"merged":[[24,0,25,4]]}
[null,null,"Worksheet for Project Budget",null,"Year:",1]
["Salaries & Wages*"]
["Name","Title","Salary Category","Salary & Wages Base","Pay Basis","Months","Effort","Requested Salary","Fringe Rate","Fringe Benefit","Total Cost"]
[]
[null,null,null,null,null,null,null,{"$f":"ROUND((IF(E5=\"Hourly (H basis)\",D5,(D5/IF(E5=\"Annual (A basis)\",12,9)*F5*G5))),0)","v":0},{"$f":"IF(ISBLANK(C5),0,(VLOOKUP(C5,Fringe_Array,2, FALSE())+($F$1*1%)))","v":0},{"$f":"ROUND((I5*H5),0)","v":0},{"$f":"SUM(H5,J5)","v":0}]
[null,null,null,null,null,null,null,0,0,0,0]
[null,null,null,null,null,null,null,0,0,0,0]
[null,null,null,null,null,null,null,0,0,0,0]
[null,null,null,null,null,null,null,0,0,0,0]
[null,null,null,null,null,null,null,0,0,0,0]
{"$rows_left_out":16}
{"sheet":"Salaries Yr 2","index":4,"n_rows":25,"n_cols":11,"rows_kept":25,"cut":false,"hidden":false,"merged":[[24,0,25,4]]}
[null,null,"Worksheet for Project Budget",null,"Year:",2]
["Salaries & Wages*"]
["Name","Title","Salary Category","Salary & Wages Base","Pay Basis","Months","Effort","Requested Salary","Fringe Rate","Fringe Benefit","Total Cost"]
[]
[null,null,null,null,null,null,null,{"$f":"ROUND((IF(E5=\"Hourly (H basis)\",D5,(D5/IF(E5=\"Annual (A basis)\",12,9)*F5*G5))),0)","v":0},{"$f":"IF(ISBLANK(C5),0,(VLOOKUP(C5,Fringe_Array,2, FALSE())+($F$1*1%)))","v":0},{"$f":"ROUND((I5*H5),0)","v":0},{"$f":"SUM(H5,J5)","v":0}]
[null,null,null,null,null,null,null,0,0,0,0]
[null,null,null,null,null,null,null,0,0,0,0]
[null,null,null,null,null,null,null,0,0,0,0]
[null,null,null,null,null,null,null,0,0,0,0]
[null,null,null,null,null,null,null,0,0,0,0]
{"$rows_left_out":16}
{"sheet":"Salaries Yr 3","index":5,"n_rows":25,"n_cols":11,"rows_kept":25,"cut":false,"hidden":false,"merged":[[24,0,25,4]]}
[null,null,"Worksheet for Project Budget",null,"Year:",3]
["Salaries & Wages*"]
["Name","Title","Salary Category","Salary & Wages Base","Pay Basis","Months","Effort","Requested Salary","Fringe Rate","Fringe Benefit","Total Cost"]
[]
[null,null,null,null,null,null,null,{"$f":"ROUND((IF(E5=\"Hourly (H basis)\",D5,(D5/IF(E5=\"Annual (A basis)\",12,9)*F5*G5))),0)","v":0},{"$f":"IF(ISBLANK(C5),0,(VLOOKUP(C5,Fringe_Array,2,FALSE())+($F$1*1%)))","v":0},{"$f":"ROUND((I5*H5),0)","v":0},{"$f":"SUM(H5,J5)","v":0}]
[null,null,null,null,null,null,null,0,0,0,0]
[null,null,null,null,null,null,null,0,0,0,0]
[null,null,null,null,null,null,null,0,0,0,0]
[null,null,null,null,null,null,null,0,0,0,0]
[null,null,null,null,null,null,null,0,0,0,0]
{"$rows_left_out":16}
{"sheet":"Salaries Yr 4","index":6,"n_rows":25,"n_cols":11,"rows_kept":25,"cut":false,"hidden":false,"merged":[[24,0,25,4]]}
[null,null,"Worksheet for Project Budget",null,"Year:",4]
["Salaries & Wages*"]
["Name","Title","Salary Category","Salary & Wages Base","Pay Basis","Months","Effort","Requested Salary","Fringe Rate","Fringe Benefit","Total Cost"]
[]
[null,null,null,null,null,null,null,{"$f":"ROUND((IF(E5=\"Hourly (H basis)\",D5,(D5/IF(E5=\"Annual (A basis)\",12,9)*F5*G5))),0)","v":0},{"$f":"IF(ISBLANK(C5),0,(VLOOKUP(C5,Fringe_Array,2,FALSE())+($F$1*1%)))","v":0},{"$f":"ROUND((I5*H5),0)","v":0},{"$f":"SUM(H5,J5)","v":0}]
[null,null,null,null,null,null,null,0,0,0,0]
[null,null,null,null,null,null,null,0,0,0,0]
[null,null,null,null,null,null,null,0,0,0,0]
[null,null,null,null,null,null,null,0,0,0,0]
[null,null,null,null,null,null,null,0,0,0,0]
{"$rows_left_out":16}
{"sheet":"Salaries Yr 5","index":7,"n_rows":25,"n_cols":11,"rows_kept":25,"cut":false,"hidden":false,"merged":[[24,0,25,4]]}
[null,null,"Worksheet for Project Budget",null,"Year:",5]
["Salaries & Wages*"]
["Name","Title","Salary Category","Salary & Wages Base","Pay Basis","Months","Effort","Requested Salary","Fringe Rate","Fringe Benefit","Total Cost"]
[]
[null,null,null,null,null,null,null,{"$f":"ROUND((IF(E5=\"Hourly (H basis)\",D5,(D5/IF(E5=\"Annual (A basis)\",12,9)*F5*G5))),0)","v":0},{"$f":"IF(ISBLANK(C5),0,(VLOOKUP(C5,Fringe_Array,2,FALSE())+($F$1*1%)))","v":0},{"$f":"ROUND((I5*H5),0)","v":0},{"$f":"SUM(H5,J5)","v":0}]
[null,null,null,null,null,null,null,0,0,0,0]
[null,null,null,null,null,null,null,0,0,0,0]
[null,null,null,null,null,null,null,0,0,0,0]
[null,null,null,null,null,null,null,0,0,0,0]
[null,null,null,null,null,null,null,0,0,0,0]
{"$rows_left_out":16}
{"sheet":"Tuition Remission","index":8,"n_rows":15,"n_cols":7,"rows_kept":15,"cut":false,"hidden":false,"merged":[[0,0,0,6],[14,0,16,6]]}
["Worksheet for Project Budget"]
["Tuition Remission"]
[]
[null,"Year 1","Year 2","Year 3","Year 4","Year 5","Cumulative "]
["Select First Semester","Select…","Select…","Select…","Select…","Select…"]
["Number of PA/RA",null,null,null,null,null,{"$f":"SUM(B6:F6)","v":0}]
["Sub-Total",{"$f":"ROUND(B6*IF(B5 = \"Fall 2017 to Fall 2025\", 6000, 5364),0)","v":0},{"$f":"ROUND(C6*IF(C5 = \"Fall 2017 to Fall 2025\", 6000, 5364),0)","v":0},{"$f":"ROUND(D6*IF(D5 = \"Fall 2017 to Fall 2025\", 6000, 5364),0)","v":0},{"$f":"ROUND(E6*IF(E5 = \"Fall 2017 to Fall 2025\", 6000, 5364),0)","v":0},{"$f":"ROUND(F6*IF(F5 = \"Fall 2017 to Fall 2025\", 6000, 5364),0)","v":0},{"$f":"SUM(B7:F7)","v":0}]
["Select Second Semester","Select…","Select…","Select…","Select…","Select…"]
["Number of PA/RA",null,null,null,null,null,{"$f":"SUM(B9:F9)","v":0}]
["Sub-Total",{"$f":"ROUND(B9*IF(B8 = \"Fall 2017 to Fall 2025\", 6000, 5364),0)","v":0},{"$f":"ROUND(C9*IF(C8 = \"Fall 2017 to Fall 2025\", 6000, 5364),0)","v":0},{"$f":"ROUND(D9*IF(D8 = \"Fall 2017 to Fall 2025\", 6000, 5364),0)","v":0},{"$f":"ROUND(E9*IF(E8 = \"Fall 2017 to Fall 2025\", 6000, 5364),0)","v":0},{"$f":"ROUND(F9*IF(F8 = \"Fall 2017 to Fall 2025\", 6000, 5364),0)","v":0},{"$f":"SUM(B10:F10)","v":0}]
{"$rows_left_out":6}
{"sheet":"Supplies","index":9,"n_rows":21,"n_cols":7,"rows_kept":21,"cut":false,"hidden":false,"merged":[]}
[null,null,"Worksheet for Project Budget"]
["Supplies"]
[]
["Category","Year 1","Year 2","Year 3","Year 4","Year 5","Cumulative"]
["Research/Lab Supplies",null,null,null,null,null,{"$f":"SUM(B5:F5)","v":0}]
["Office Supplies",null,null,null,null,null,0]
["Equipment & Furniture (items less than $5000)",null,0,0,0,0,0]
["Research Equipment (items less than $5000).",null,null,null,null,0,0]
["Office Equipment & Furniture (items less than $5000)",null,null,null,0,0,0]
["Computer Equipment (items less than $5000)",null,null,null,0,0,0]
{"$rows_left_out":12}
{"sheet":"Equipment & Capital","index":10,"n_rows":34,"n_cols":7,"rows_kept":34,"cut":false,"hidden":false,"merged":[]}
[null,null,"Worksheet for Project Budget"]
["Equipment & Other Capital (individual items over $5,000)"]
[]
["Category","Year 1","Year 2","Year 3","Year 4","Year 5","Cumulative "]
["Research/Lab Equipment (items over $5000)"]
[null,null,null,null,0,0,{"$f":"SUM(B6:F6)","v":0}]
[null,null,null,null,null,null,{"$f":"SUM(B7:F7)","v":0}]
[null,null,null,null,null,null,{"$f":"SUM(B8:F8)","v":0}]
["Office Equipment             (items over $5000)"]
[null,null,0,0,0,0,{"$f":"SUM(B10:F10)","v":0}]
{"$rows_left_out":25}
{"sheet":"Travel","index":11,"n_rows":24,"n_cols":7,"rows_kept":24,"cut":false,"hidden":false,"merged":[]}
[null,null,"Worksheet for Project Budget"]
["Travel"]
[]
["Category","Year 1","Year 2","Year 3","Year 4","Year 5","Cumulative "]
["Domestic"]
["      Fleet Charges",null,null,null,null,null,{"$f":"SUM(B6:F6)","v":0}]
["      Conferences/Conventions",null,null,null,null,null,{"$f":"SUM(B7:F7)","v":0}]
["      Business/Research Travel",null,null,null,null,null,{"$f":"SUM(B8:F8)","v":0}]
["      Other",null,null,null,null,null,{"$f":"SUM(B9:F9)","v":0}]
["Conference & Meeting Expenses (UW hosted events)"]
{"$rows_left_out":15}
{"sheet":"Participant Support Costs","index":12,"n_rows":16,"n_cols":7,"rows_kept":16,"cut":false,"hidden":false,"merged":[[0,0,0,6],[1,0,1,6],[2,0,2,6],[13,1,13,2],[15,0,15,6]]}
["Worksheet for Project Budget"]
["Participant Support Costs (Excluded from MTDC)"]
["May be included in NIH budget only if specifically identified as allowable in the Funding Opportunity Announcement. For the purposes of the Kirschstein-NRSA programs, the term \"participant support costs\" does not apply."]
[]
[]
[]
["Category","Year 1","Year 2","Year 3","Year 4","Year 5","Cumulative"]
["Stipends",null,null,null,null,null,{"$f":"(B8)+(C8)+(D8)+(E8)+(F8)","v":0}]
["Travel",null,null,null,null,null,{"$f":"(B9)+(C9)+(D9)+(E9)+(F9)","v":0}]
["Subsistence",null,null,null,null,null,{"$f":"(B10)+(C10)+(D10)+(E10)+(F10)","v":0}]
{"$rows_left_out":7}
{"sheet":"Other Direct","index":13,"n_rows":30,"n_cols":7,"rows_kept":30,"cut":false,"hidden":false,"merged":[]}
[null,null,"Worksheet for Project Budget"]
["Other Direct Charges"]
[]
["Category","Year 1","Year 2","Year 3","Year 4","Year 5","Cumulative"]
["Included in MTDC"]
["Lab Animal Care & per diem",null,null,null,null,null,{"$f":"SUM(B6:F6)","v":0}]
["Postage & Overnight Delivery",null,null,null,null,null,0]
["Telephone (long distance or dedicated lines)",null,null,null,null,null,0]
["Research Subjects",null,null,null,null,null,0]
["Consultants",null,null,null,null,null,0]
{"$rows_left_out":21}
{"sheet":"Sub-Agreements","index":14,"n_rows":25,"n_cols":13,"rows_kept":25,"cut":false,"hidden":false,"merged":[[24,11,24,12],[24,1,24,2],[24,3,24,4],[24,5,24,6],[24,7,24,8],[24,9,24,10],[22,11,22,12],[23,1,23,2],[23,3,23,4],[23,5,23,6],[23,7,23,8],[23,9,23,10],[23,11,23,12],[22,1,22,2],[22,3,22,4],[22,5,22,6],[22,7,22,8],[22,9,22,10],[3,9,3,10],[3,11,3,12],[21,1,21,2],[21,3,21,4],[21,5,21,6],[21,7,21,8],[21,9,21,10],[21,11,21,12],[3,0,4,0],[3,1,3,2],[3,3,3,4],[3,5,3,6],[3,7,3,8]]}
[null,null,null,null,"Worksheet for Project Budget"]
["Sub-Agreements"]
[]
["Entity Name","Year 1",null,"Year 2",null,"Year 3",null,"Year 4",null,"Year 5",null,"Cumulative "]
[null,"Direct","F&A","Direct","F&A","Direct","F&A","Direct","F&A","Direct","F&A","Direct","F&A"]
[null,null,null,null,null,null,null,null,null,null,null,{"$f":"SUM(B6,D6,F6,H6,J6)","v":0},{"$f":"SUM(C6,E6,G6,I6,K6)","v":0}]
[null,null,null,null,null,null,null,null,null,null,null,0,0]
[null,null,null,null,null,null,null,null,null,null,null,0,0]
[null,null,null,null,null,null,null,null,null,null,null,0,0]
[null,null,null,null,null,null,null,null,null,null,null,0,0]
{"$rows_left_out":16}
{"sheet":"MTDC","index":15,"n_rows":57,"n_cols":7,"rows_kept":57,"cut":false,"hidden":false,"merged":[]}
[null,null,"Worksheet for Project Budget"]
["MTDC"]
[]
[null,"Year 1","Year 2","Year 3","Year 4","Year 5","Cumulative "]
["Salaries/Wages/Fringe",{"$f":"ROUND(SUM('Salaries Yr 1'!H5:H21)+(SUM('Salaries Yr 1'!J5:J21)),0)","v":0},{"$f":"ROUND(SUM('Salaries Yr 2'!H5:H21)+(SUM('Salaries Yr 2'!J5:J21)),0)","v":0},{"$f":"ROUND(SUM('Salaries Yr 3'!H5:H21)+(SUM('Salaries Yr 3'!J5:J21)),0)","v":0},{"$f":"ROUND(SUM('Salaries Yr 4'!H5:H21)+(SUM('Salaries Yr 4'!J5:J21)),0)","v":0},{"$f":"ROUND(SUM('Salaries Yr 5'!H5:H21)+(SUM('Salaries Yr 5'!J5:J21)),0)","v":0},{"$f":"SUM(B5:F5)","v":0}]
["Supplies",{"$f":"Supplies!B21","v":0},{"$f":"Supplies!C21","v":0},{"$f":"Supplies!D21","v":0},{"$f":"Supplies!E21","v":0},{"$f":"Supplies!F21","v":0},{"$f":"SUM(B6:F6)","v":0}]
["Travel",{"$f":"Travel!B16+Travel!B22","v":0},{"$f":"Travel!C16+Travel!C22","v":0},{"$f":"Travel!D16+Travel!D22","v":0},{"$f":"Travel!E16+Travel!E22","v":0},{"$f":"Travel!F16+Travel!F22","v":0},{"$f":"SUM(B7:F7)","v":0}]
["Other Direct Charges",{"$f":"ROUND(SUM('Other Direct'!B6:B20),0)","v":0},{"$f":"ROUND(SUM('Other Direct'!C6:C20),0)","v":0},{"$f":"ROUND(SUM('Other Direct'!D6:D20),0)","v":0},{"$f":"ROUND(SUM('Other Direct'!E6:E20),0)","v":0},{"$f":"ROUND(SUM('Other Direct'!F6:F20),0)","v":0},{"$f":"SUM(B8:F8)","v":0}]
["Sub-Agreements","Update"]
[{"$f":"'Sub-Agreements'!A6","v":0},{"$f":"IF(('Sub-Agreements'!B6+'Sub-Agreements'!C6)>25000,25000,('Sub-Agreements'!B6+'Sub-Agreements'!C6))","v":0},{"$f":"IF(('Sub-Agreements'!D6+'Sub-Agreements'!E6)=0,0,IF(B10=25000,0,IF(('Sub-Agreements'!D6+'Sub-Agreements'!E6)<(25000-B10),('Sub-Agreements'!D6+'Sub-Agreements'!E6),(25000-B10))))","v":0},{"$f":"IF(('Sub-Agreements'!F6+'Sub-Agreements'!G6)=0,0,IF(SUM(B10,C10)=25000,0,IF(('Sub-Agreements'!F6+'Sub-Agreements'!G6)<(25000-SUM(B10,C10)),('Sub-Agreements'!F6+'Sub-Agreements'!G6),(25000-SUM(B10,C10)))))","v":0},{"$f":"IF(('Sub-Agreements'!H6+'Sub-Agreements'!I6)=0,0,IF(SUM(B10,C10,D10)=25000,0,IF(('Sub-Agreements'!H6+'Sub-Agreements'!I6)<(25000-SUM(B10,C10,D10)),('Sub-Agreements'!H6+'Sub-Agreements'!I6),(25000-SUM(B10,C10,D10)))))","v":0},{"$f":"IF(('Sub-Agreements'!J6+'Sub-Agreements'!K6)=0,0,IF(SUM(B10,C10,D10,E10)=25000,0,IF(('Sub-Agreements'!J6+'Sub-Agreements'!K6)<(25000-SUM(B10,C10,D10,E10)),('Sub-Agreements'!J6+'Sub-Agreements'!K6),(25000-SUM(B10,C10,D10,E10)))))","v":0},{"$f":"SUM(B10:F10)","v":0}]
{"$rows_left_out":48}
{"sheet":"Total","index":16,"n_rows":31,"n_cols":7,"rows_kept":31,"cut":false,"hidden":false,"merged":[[1,1,1,6],[2,1,2,6],[4,1,4,6]]}
[null,null,"PROJECT BUDGET"]
["Sponsor:",{"$f":"Title!C2","v":0}]
["Project Title:",{"$f":"Title!C4","v":0}]
["Project Period:","Begin:",{"$f":"Title!D6","v":"00:00:00"},"End:",{"$f":"Title!F6","v":"00:00:00"}]
["Principal Investigator:",{"$f":"Title!C8","v":0}]
[null,"Year 1","Year 2","Year 3","Year 4","Year 5","Cumulative"]
["Salaries & Wages",{"$f":"'Salaries Yr 1'!H23","v":0},{"$f":"'Salaries Yr 2'!H23","v":0},{"$f":"'Salaries Yr 3'!H23","v":0},{"$f":"'Salaries Yr 4'!H23","v":0},{"$f":"'Salaries Yr 5'!H23","v":0},{"$f":"SUM(B7:F7)","v":0}]
["Fringe Benefits",{"$f":"'Salaries Yr 1'!J23","v":0},{"$f":"'Salaries Yr 2'!J23","v":0},{"$f":"'Salaries Yr 3'!J23","v":0},{"$f":"'Salaries Yr 4'!J23","v":0},{"$f":"'Salaries Yr 5'!J23","v":0},0]
["Equipment & Other Capital",{"$f":"'Equipment & Capital'!B34","v":0},{"$f":"'Equipment & Capital'!C34","v":0},{"$f":"'Equipment & Capital'!D34","v":0},{"$f":"'Equipment & Capital'!E34","v":0},{"$f":"'Equipment & Capital'!F34","v":0},0]
["Supplies",{"$f":"Supplies!B21","v":0},{"$f":"Supplies!C21","v":0},{"$f":"Supplies!D21","v":0},{"$f":"Supplies!E21","v":0},{"$f":"Supplies!F21","v":0},0]
{"$rows_left_out":22}
{"sheet":"NIH Modular","index":17,"n_rows":44,"n_cols":18,"rows_kept":44,"cut":false,"hidden":false,"merged":[[39,6,39,7],[40,6,40,7],[42,6,42,7],[43,6,43,7],[31,6,31,7],[35,6,35,7],[36,6,36,7],[37,6,37,7],[38,6,38,7],[26,6,26,7],[27,6,27,7],[28,6,28,7],[29,6,29,7],[30,6,30,7],[17,6,17,7],[18,6,18,7],[19,6,19,7],[20,6,20,7],[21,6,21,7],[8,6,8,7],[9,6,9,7],[11,6,11,7],[12,6,12,7],[13,6,13,7],[1,5,1,7],[2,0,2,7],[3,0,3,7],[6,6,6,7],[7,6,7,7]]}
[]
[null,null,null,null,"PI Name:",{"$f":"Title!C8","v":0}]
["University of Wisconsin-Madison"]
["NIH Modular Grant Budget Tabulator"]
["Print this template and submit it with your NIH modular grant application to your Dean's Office.  This form will be used for  "]
["internal purposes only and will not be sent to NIH."]
[null,"Year One","Year Two ","Year Three","Year Four","Year Five","Cumulative Total"]
[]
["Category A (Exempt from F&A costs)"]
["Equipment Items over $5,000 ",{"$f":"'Equipment & Capital'!B34","v":0},{"$f":"'Equipment & Capital'!C34","v":0},{"$f":"'Equipment & Capital'!D34","v":0},{"$f":"'Equipment & Capital'!E34","v":0},{"$f":"'Equipment & Capital'!F34","v":0},{"$f":"SUM(B10:F10)","v":0}]
{"$rows_left_out":34}